{"text_format":"1","workbook":"xlsx","n_sheets":10,"sheets":["Introduction","Instructions","Summary of scores","Critical Care Services Structur","Critical Care Services Workforc","Critical Care Services Process","Clinical Care","Additional Components","Emergency Preparedness","Lookups"],"not_rendered":{"charts":0,"images":4,"macros":1,"external_links":0,"defined_names":72,"comments":0,"pivot_tables":0},"unopened":[],"bounds":{"document_bytes":16777216,"sheet_cells":100000,"rows_first":2000,"rows_last":500,"rows_between":2000,"halvings":0,"cell_chars":16384,"cell_head_chars":4096},"cells_cut":0,"cells_raw":0,"read":"whole","date_system":"1900"}

{"sheet":"Introduction","index":0,"n_rows":12,"n_cols":9,"rows_kept":12,"cut":false,"hidden":false,"merged":[[5,0,5,18],[6,0,6,18]]}
["An Excel tool kit for the Guidelines for the Provision of Intensive Care Services V2, 2019."]
[]
[]
[]
["Introduction"]
["In June 2019, the Intensive Care Society (ICS) and Faculty of Intensive Care Medicine (FICM) released the second edition of Guidelines for the Provision of Intensive Care Services (GPICS). The first edition of GPICS (2015) built on the earlier Core Standards for Intensive Care Units (2013) and has become the definitive reference source for the planning, commissioning and delivery of Adult Critical Care Services in the UK. Many units have found the GPICS standards and recommendations to be invaluable in developing successful business cases to enhance their local services and improve patient care. GPICS has also been used as the benchmark by which local services are peer reviewed and assessed by healthcare regulators, such as the Care Quality Commission (CQC).\nThe ICS and FICM have worked in collaboration to develop this tool kit to help individual units to compare their services to the latest version of GPICS. The standards and recommendations are presented in Excel format with a drop down option of ‘met’, ‘partially met’, ‘unmet’ or ‘not applicable to this service’ next to each guideline. The tool kit also allows units to produce a PDF summary page which provides a useful overview of their responses."]
["This tool kit is not stand-alone and should be used alongside the full GPICS document which is available via the link below. We recommend that the toolkit is completed in collaboration with members of the multi-disciplinary team, so that each section is completed by individuals who are best placed to make an accurate assessment. We are aware that defining compliance with standards and recommendations is difficult and have deliberately left this to the judgment of local clinicians and managers.\nWe see the further development of this tool kit as an iterative process, working with individuals and networks to improve and refine its functionality. If you have any suggestions or comments please contact us at info@ics.ac.uk.\nWe hope you find this tool kit useful."]
["Click the following link to see the full GPICS document online: ",null,null,null,null,"https://bit.ly/GPICSTool",null,null,"or double click on the embedded PDF (you may need to switch to Windows to view after opening) >"]
[]
["Click here to view the Instructions sheet"]
{"$rows_left_out":3}
{"sheet":"Instructions","index":1,"n_rows":19,"n_cols":6,"rows_kept":19,"cut":false,"hidden":false,"merged":[[6,3,6,9],[8,3,8,4],[11,0,11,12],[15,0,15,8],[18,0,18,12],[7,3,7,9]]}
["An Excel tool kit for the Guidelines for the Provision of Intensive Care Services V2, 2019."]
[]
[]
[]
["Instructions"]
["1. To add your unit name to the summary page please enter it here:"]
["Critical care unit name:"]
["Operational Delivery Network (ODN) /Region"]
["Date (dd/mm/yyyy)"]
[]
{"$rows_left_out":10}
{"sheet":"Summary of scores","index":2,"n_rows":69,"n_cols":20,"rows_kept":69,"cut":false,"hidden":false,"merged":[[2,2,2,4],[2,5,2,7],[2,9,2,11],[2,12,2,14]]}
[null,"Summary of the gap analysis of your ICU compared to the GPICS v2  Report date: ",null,null,null,null,null,null,null,"Hidden","Hidden","Hidden","Hidden","Hidden","Hidden","Hidden","Hidden","Hidden","Hidden","Hidden"]
[null,null,null,null,null,null,null,null,null,"NotMet","PartiallyMet","FullyMet","NotMet","PartiallyMet","FullyMet"]
["Section","Description","STANDARDS",null,null,"RECOMMENDATIONS",null,null,"Complete","STANDARDS",null,null,"RECOMMENDATIONS",null,null,"STANDARDS","RECOMMENDATIONS","Total count","N/A","Total count incl N/A"]
[null,null,"Not Met","Partly Met","Fully Met","Not Met","Partly Met","Fully Met"]
[1,"CRITICAL CARE SERVICES: STRUCTURE"]
[1.1000000000000001,"Levels of Critical Care",{"$f":"IFERROR(J6/$P6,\"-\")","v":0},0,0,{"$f":"IFERROR(M6/$Q6,\"-\")","v":0},0,0,{"$f":"IF(AND(SUM(J6:O6)=SUM(P6:Q6),T6=R6+S6),1,0)","v":0},{"$f":"COUNTIFS('Critical Care Services Structur'!$E:$E,J$3,'Critical Care Services Structur'!$F:$F,$A6,'Critical Care Services Structur'!$D:$D,NotMet)","v":0},{"$f":"COUNTIFS('Critical Care Services Structur'!$E:$E,J$3,'Critical Care Services Structur'!$F:$F,$A6,'Critical Care Services Structur'!$D:$D,PartiallyMet)","v":0},{"$f":"COUNTIFS('Critical Care Services Structur'!$E:$E,J$3,'Critical Care Services Structur'!$F:$F,$A6,'Critical Care Services Structur'!$D:$D,FullyMet)","v":0},{"$f":"COUNTIFS('Critical Care Services Structur'!$E:$E,M$3,'Critical Care Services Structur'!$F:$F,$A6,'Critical Care Services Structur'!$D:$D,NotMet)","v":0},{"$f":"COUNTIFS('Critical Care Services Structur'!$E:$E,M$3,'Critical Care Services Structur'!$F:$F,$A6,'Critical Care Services Structur'!$D:$D,PartiallyMet)","v":0},{"$f":"COUNTIFS('Critical Care Services Structur'!$E:$E,M$3,'Critical Care Services Structur'!$F:$F,$A6,'Critical Care Services Structur'!$D:$D,FullyMet)","v":0},{"$f":"COUNTIFS('Critical Care Services Structur'!$E:$E,P$3,'Critical Care Services Structur'!$F:$F,$A6)-COUNTIFS('Critical Care Services Structur'!$E:$E,J$3,'Critical Care Services Structur'!$F:$F,$A6,'Critical Care Services Structur'!$D:$D,NotApplicable)","v":2},{"$f":"COUNTIFS('Critical Care Services Structur'!$E:$E,Q$3,'Critical Care Services Structur'!$F:$F,$A6)-COUNTIFS('Critical Care Services Structur'!$E:$E,K$3,'Critical Care Services Structur'!$F:$F,$A6,'Critical Care Services Structur'!$D:$D,NotApplicable)","v":1},{"$f":"SUM(P6:Q6)","v":3},{"$f":"COUNTIFS('Critical Care Services Structur'!$F:$F,$A6,'Critical Care Services Structur'!$D:$D,NotApplicable)","v":0},{"$f":"COUNTIFS('Critical Care Services Structur'!$E:$E,P$3,'Critical Care Services Structur'!$F:$F,$A6)+COUNTIFS('Critical Care Services Structur'!$E:$E,Q$3,'Critical Care Services Structur'!$F:$F,$A6)","v":3}]
[1.2,"Outcomes",{"$f":"IFERROR(J7/$P7,\"-\")","v":0},0,0,{"$f":"IFERROR(M7/$Q7,\"-\")","v":0},0,0,0,{"$f":"COUNTIFS('Critical Care Services Structur'!$E:$E,J$3,'Critical Care Services Structur'!$F:$F,$A7,'Critical Care Services Structur'!$D:$D,NotMet)","v":0},{"$f":"COUNTIFS('Critical Care Services Structur'!$E:$E,J$3,'Critical Care Services Structur'!$F:$F,$A7,'Critical Care Services Structur'!$D:$D,PartiallyMet)","v":0},{"$f":"COUNTIFS('Critical Care Services Structur'!$E:$E,J$3,'Critical Care Services Structur'!$F:$F,$A7,'Critical Care Services Structur'!$D:$D,FullyMet)","v":0},{"$f":"COUNTIFS('Critical Care Services Structur'!$E:$E,M$3,'Critical Care Services Structur'!$F:$F,$A7,'Critical Care Services Structur'!$D:$D,NotMet)","v":0},{"$f":"COUNTIFS('Critical Care Services Structur'!$E:$E,M$3,'Critical Care Services Structur'!$F:$F,$A7,'Critical Care Services Structur'!$D:$D,PartiallyMet)","v":0},{"$f":"COUNTIFS('Critical Care Services Structur'!$E:$E,M$3,'Critical Care Services Structur'!$F:$F,$A7,'Critical Care Services Structur'!$D:$D,FullyMet)","v":0},{"$f":"COUNTIFS('Critical Care Services Structur'!$E:$E,P$3,'Critical Care Services Structur'!$F:$F,$A7)-COUNTIFS('Critical Care Services Structur'!$E:$E,J$3,'Critical Care Services Structur'!$F:$F,$A7,'Critical Care Services Structur'!$D:$D,NotApplicable)","v":4},{"$f":"COUNTIFS('Critical Care Services Structur'!$E:$E,Q$3,'Critical Care Services Structur'!$F:$F,$A7)-COUNTIFS('Critical Care Services Structur'!$E:$E,K$3,'Critical Care Services Structur'!$F:$F,$A7,'Critical Care Services Structur'!$D:$D,NotApplicable)","v":3},{"$f":"SUM(P7:Q7)","v":7},{"$f":"COUNTIFS('Critical Care Services Structur'!$F:$F,$A7,'Critical Care Services Structur'!$D:$D,NotApplicable)","v":0},{"$f":"COUNTIFS('Critical Care Services Structur'!$E:$E,P$3,'Critical Care Services Structur'!$F:$F,$A7)+COUNTIFS('Critical Care Services Structur'!$E:$E,Q$3,'Critical Care Services Structur'!$F:$F,$A7)","v":7}]
[1.3,"Level 2 and 3 Physical Facilities",{"$f":"IFERROR(J8/$P8,\"-\")","v":0},0,0,{"$f":"IFERROR(M8/$Q8,\"-\")","v":0},0,0,0,{"$f":"COUNTIFS('Critical Care Services Structur'!$E:$E,J$3,'Critical Care Services Structur'!$F:$F,$A8,'Critical Care Services Structur'!$D:$D,NotMet)","v":0},{"$f":"COUNTIFS('Critical Care Services Structur'!$E:$E,J$3,'Critical Care Services Structur'!$F:$F,$A8,'Critical Care Services Structur'!$D:$D,PartiallyMet)","v":0},{"$f":"COUNTIFS('Critical Care Services Structur'!$E:$E,J$3,'Critical Care Services Structur'!$F:$F,$A8,'Critical Care Services Structur'!$D:$D,FullyMet)","v":0},{"$f":"COUNTIFS('Critical Care Services Structur'!$E:$E,M$3,'Critical Care Services Structur'!$F:$F,$A8,'Critical Care Services Structur'!$D:$D,NotMet)","v":0},{"$f":"COUNTIFS('Critical Care Services Structur'!$E:$E,M$3,'Critical Care Services Structur'!$F:$F,$A8,'Critical Care Services Structur'!$D:$D,PartiallyMet)","v":0},{"$f":"COUNTIFS('Critical Care Services Structur'!$E:$E,M$3,'Critical Care Services Structur'!$F:$F,$A8,'Critical Care Services Structur'!$D:$D,FullyMet)","v":0},{"$f":"COUNTIFS('Critical Care Services Structur'!$E:$E,P$3,'Critical Care Services Structur'!$F:$F,$A8)-COUNTIFS('Critical Care Services Structur'!$E:$E,J$3,'Critical Care Services Structur'!$F:$F,$A8,'Critical Care Services Structur'!$D:$D,NotApplicable)","v":3},{"$f":"COUNTIFS('Critical Care Services Structur'!$E:$E,Q$3,'Critical Care Services Structur'!$F:$F,$A8)-COUNTIFS('Critical Care Services Structur'!$E:$E,K$3,'Critical Care Services Structur'!$F:$F,$A8,'Critical Care Services Structur'!$D:$D,NotApplicable)","v":8},11,{"$f":"COUNTIFS('Critical Care Services Structur'!$F:$F,$A8,'Critical Care Services Structur'!$D:$D,NotApplicable)","v":0},{"$f":"COUNTIFS('Critical Care Services Structur'!$E:$E,P$3,'Critical Care Services Structur'!$F:$F,$A8)+COUNTIFS('Critical Care Services Structur'!$E:$E,Q$3,'Critical Care Services Structur'!$F:$F,$A8)","v":11}]
[1.4,"Clinical Information Systems",{"$f":"IFERROR(J9/$P9,\"-\")","v":0},0,0,{"$f":"IFERROR(M9/$Q9,\"-\")","v":0},0,0,0,{"$f":"COUNTIFS('Critical Care Services Structur'!$E:$E,J$3,'Critical Care Services Structur'!$F:$F,$A9,'Critical Care Services Structur'!$D:$D,NotMet)","v":0},{"$f":"COUNTIFS('Critical Care Services Structur'!$E:$E,J$3,'Critical Care Services Structur'!$F:$F,$A9,'Critical Care Services Structur'!$D:$D,PartiallyMet)","v":0},{"$f":"COUNTIFS('Critical Care Services Structur'!$E:$E,J$3,'Critical Care Services Structur'!$F:$F,$A9,'Critical Care Services Structur'!$D:$D,FullyMet)","v":0},{"$f":"COUNTIFS('Critical Care Services Structur'!$E:$E,M$3,'Critical Care Services Structur'!$F:$F,$A9,'Critical Care Services Structur'!$D:$D,NotMet)","v":0},{"$f":"COUNTIFS('Critical Care Services Structur'!$E:$E,M$3,'Critical Care Services Structur'!$F:$F,$A9,'Critical Care Services Structur'!$D:$D,PartiallyMet)","v":0},{"$f":"COUNTIFS('Critical Care Services Structur'!$E:$E,M$3,'Critical Care Services Structur'!$F:$F,$A9,'Critical Care Services Structur'!$D:$D,FullyMet)","v":0},{"$f":"COUNTIFS('Critical Care Services Structur'!$E:$E,P$3,'Critical Care Services Structur'!$F:$F,$A9)-COUNTIFS('Critical Care Services Structur'!$E:$E,J$3,'Critical Care Services Structur'!$F:$F,$A9,'Critical Care Services Structur'!$D:$D,NotApplicable)","v":5},{"$f":"COUNTIFS('Critical Care Services Structur'!$E:$E,Q$3,'Critical Care Services Structur'!$F:$F,$A9)-COUNTIFS('Critical Care Services Structur'!$E:$E,K$3,'Critical Care Services Structur'!$F:$F,$A9,'Critical Care Services Structur'!$D:$D,NotApplicable)","v":10},15,{"$f":"COUNTIFS('Critical Care Services Structur'!$F:$F,$A9,'Critical Care Services Structur'!$D:$D,NotApplicable)","v":0},{"$f":"COUNTIFS('Critical Care Services Structur'!$E:$E,P$3,'Critical Care Services Structur'!$F:$F,$A9)+COUNTIFS('Critical Care Services Structur'!$E:$E,Q$3,'Critical Care Services Structur'!$F:$F,$A9)","v":15}]
[1.5,"Clinical Equipment",{"$f":"IFERROR(J10/$P10,\"-\")","v":0},0,0,{"$f":"IFERROR(M10/$Q10,\"-\")","v":0},0,0,0,{"$f":"COUNTIFS('Critical Care Services Structur'!$E:$E,J$3,'Critical Care Services Structur'!$F:$F,$A10,'Critical Care Services Structur'!$D:$D,NotMet)","v":0},{"$f":"COUNTIFS('Critical Care Services Structur'!$E:$E,J$3,'Critical Care Services Structur'!$F:$F,$A10,'Critical Care Services Structur'!$D:$D,PartiallyMet)","v":0},{"$f":"COUNTIFS('Critical Care Services Structur'!$E:$E,J$3,'Critical Care Services Structur'!$F:$F,$A10,'Critical Care Services Structur'!$D:$D,FullyMet)","v":0},{"$f":"COUNTIFS('Critical Care Services Structur'!$E:$E,M$3,'Critical Care Services Structur'!$F:$F,$A10,'Critical Care Services Structur'!$D:$D,NotMet)","v":0},{"$f":"COUNTIFS('Critical Care Services Structur'!$E:$E,M$3,'Critical Care Services Structur'!$F:$F,$A10,'Critical Care Services Structur'!$D:$D,PartiallyMet)","v":0},{"$f":"COUNTIFS('Critical Care Services Structur'!$E:$E,M$3,'Critical Care Services Structur'!$F:$F,$A10,'Critical Care Services Structur'!$D:$D,FullyMet)","v":0},{"$f":"COUNTIFS('Critical Care Services Structur'!$E:$E,P$3,'Critical Care Services Structur'!$F:$F,$A10)-COUNTIFS('Critical Care Services Structur'!$E:$E,J$3,'Critical Care Services Structur'!$F:$F,$A10,'Critical Care Services Structur'!$D:$D,NotApplicable)","v":16},{"$f":"COUNTIFS('Critical Care Services Structur'!$E:$E,Q$3,'Critical Care Services Structur'!$F:$F,$A10)-COUNTIFS('Critical Care Services Structur'!$E:$E,K$3,'Critical Care Services Structur'!$F:$F,$A10,'Critical Care Services Structur'!$D:$D,NotApplicable)","v":2},18,{"$f":"COUNTIFS('Critical Care Services Structur'!$F:$F,$A10,'Critical Care Services Structur'!$D:$D,NotApplicable)","v":0},{"$f":"COUNTIFS('Critical Care Services Structur'!$E:$E,P$3,'Critical Care Services Structur'!$F:$F,$A10)+COUNTIFS('Critical Care Services Structur'!$E:$E,Q$3,'Critical Care Services Structur'!$F:$F,$A10)","v":18}]
{"$rows_left_out":60}
{"sheet":"Critical Care Services Structur","index":3,"n_rows":145,"n_cols":7,"rows_kept":145,"cut":false,"hidden":false,"merged":[]}
["Section 1","CRITICAL CARE SERVICES: STRUCTURE","Level description","Choose level","Hidden","Hidden","Comments"]
[null,null,null,null,"-"]
[1.1000000000000001,"Levels of Critical Care",null,null,"-"]
[null,null,null,null,"-"]
["STANDARDS",null,null,null,"-"]
[1,"All patients admitted to a critical care unit must be included in a national clinical audit programme in which Levels of Care data are collected."," met / not met",null,"STANDARDS",{"$f":"$A$3","v":1.1000000000000001}]
[2,"Level of Care classification must not be used in isolation to decide upon a patient's requirements."," met/ not met ",null,"STANDARDS",{"$f":"$A$3","v":1.1000000000000001}]
[null,null,null,null,"-"]
["RECOMMENDATIONS",null,null,null,"-"]
[null,"None.",null,null,"RECOMMENDATIONS",{"$f":"$A$3","v":1.1000000000000001}]
{"$rows_left_out":136}
{"sheet":"Critical Care Services Workforc","index":4,"n_rows":271,"n_cols":7,"rows_kept":271,"cut":false,"hidden":false,"merged":[]}
["Section 2","CRITICAL CARE SERVICES: WORKFORCE","Level description","Level","Hidden","Hidden","Comments"]
[null,null,null,null,"-"]
[2.1,"Medical Staffing",null,null,"-"]
[null,null,null,null,"-"]
["STANDARDS",null,null,null,"-"]
[1,"Patients’ care must be led by a consultant in Intensive Care Medicine, who is defined as “…. a consultant who is a Fellow/Associate Fellow or eligible to become a Fellow/Associate Fellow of the Faculty of Intensive Care Medicine. A consultant in Intensive Care Medicine will have daytime Direct Clinical Care Programmed Activities in Intensive Care Medicine identified in their job plan. These programmed activities will be exclusively in ICM and the Consultant will not be responsible for a second speciality at the same time.” "," Met = 24/7 cover by consultant in ICM, partially met = all daytimes covered by ICM consultnat but 1-2 nights per week covered by an anaesthetist with direct telephone access to a named \"second on call\" ICM consultant  not met = anything else",null,"STANDARDS",2.1]
[2,"Consultant work patterns must deliver continuity of care.","Met = daytime consutlants work blocks of 3 or more days, with job planned handover time, partially met = blocks of <3 days or days themselves divded but with clear handover, not met = anything else",null,"STANDARDS",2.1]
[3,"The daytime consultant to patient ratio must not normally exceed a range between 1:8 and 1:12.","Fully met = 7 days a week, partially met = 5 days per week",null,"STANDARDS",2.1]
[4,"The daytime intensive care resident to patient ratio should not normally exceed 1:8. ","Fully met = 7 days a week, partially met = 5 days per week",null,"STANDARDS",2.1]
[5,"All staff that contribute to the resident rota must have basic airway skills. All critical care units must have immediate 24/7 on-site access to a doctor or ACCP with advanced airway skills. ","Met / not met ",null,"STANDARDS",2.1]
{"$rows_left_out":262}
{"sheet":"Critical Care Services Process","index":5,"n_rows":279,"n_cols":7,"rows_kept":279,"cut":false,"hidden":false,"merged":[]}
["Section 3","CRITICAL CARE SERVICES: PROCESS","Level description","Level","Hidden","Hidden","Comments"]
[null,null,null,null,"-"]
[3.1,"Admission, Discharge and Handover",null,null,"-"]
[null,null,null,null,"-"]
["STANDARDS",null,null,null,"-"]
[1,"The decision to admit to the critical care unit and the management plan must be discussed with the duty consultant in Intensive Care Medicine."," Met = >95%, partial = >90%, not <90% or not data",null,"STANDARDS",3.1]
[2,"There must be documentation in the patient record of the time and decision to admit to critical care.","< 85% met, 75-85 partially met, < 75% or no data not met",null,"STANDARDS",3.1]
[3,"Unplanned admissions to the critical care unit must occur within four hours of making the decision to admit."," Met = >95%, partial = >90%, not <90% or no data",null,"STANDARDS",3.1]
[4,"Patients must have a clear and documented treatment escalation plan.","Met >95%, partial 80-95%, not <80 or no audit evidence",null,"STANDARDS",3.1]
[5,"Patients must be reviewed, in person, by a consultant in Intensive Care Medicine as urgently as the clinical state dictates and always within 12 hours of admission to critical care.","95% of the time - Met, <95% or no data - not met",null,"STANDARDS",3.1]
{"$rows_left_out":270}
{"sheet":"Clinical Care","index":6,"n_rows":250,"n_cols":7,"rows_kept":250,"cut":false,"hidden":false,"merged":[]}
["Section 4","CRITICAL CARE SERVICES: CLINICAL CARE","Level description","Level","Hidden","Hidden","Comments"]
[null,null,null,null,"-"]
[4.0999999999999996,"Respiratory Support",null,null,"-"]
[null,null,null,null,"-"]
["STANDARDS",null,null,null,"-"]
[1,"Units must have access to sufficient modern invasive and non-invasive ventilators which will support pressure/volume controlled ventilation, titration of inspired oxygen concentration, support spontaneous ventilation and allow application of PEEP.","met / not met",null,"STANDARDS",4.0999999999999996]
[2,"Pulse oximetry, capnography, ECG, blood pressure monitoring and ventilator alarms must be used for all ventilated patients whose trachea is intubated.","met / not met",null,"STANDARDS",4.0999999999999996]
[3,"An accurate height must be measured on admission for every patient requiring invasive mechanical ventilation to calculate predicted body weight (PBW) and corresponding target tidal volume to allow protective ventilation (6ml/kg PBW in those with ARDS or at risk of ARDS).","met / not met",null,"STANDARDS",4.0999999999999996]
[4,"Units must have evidence-based, written guidelines covering the use of non-invasive ventilation, the management of ARDS, prevention of ventilator-associated pneumonia and weaning from ventilation (including the use of sedation).","met - guidelines for all and review date within last 3 years , partially met - one or more gudielines missing or not reviewed within the last 3 years, not met - limited guidlines and / or older than 3 years ",null,"STANDARDS",4.0999999999999996]
[5,"Referral pathways for patients with severe but potentially reversible acute hypoxaemic respiratory failure must be in place with Regional Extra-corporeal Membrane Oxygenation-capable (ECMO) Centres. ","met / not met",null,"STANDARDS",4.0999999999999996]
{"$rows_left_out":241}
{"sheet":"Additional Components","index":7,"n_rows":90,"n_cols":7,"rows_kept":90,"cut":false,"hidden":false,"merged":[]}
["Section 5","CRITICAL CARE SERVICES: ADDITIONAL COMPONENTS","Level description","Level","Hidden","Hidden","Comments"]
[null,null,null,null,"-"]
[5.0999999999999996,"Research and Development",null,null,"-"]
["STANDARDS",null,null,null,"-"]
[1,"All individuals participating in R&D activity must have completed Good Clinical Practice (GCP) training for research and keep this up to date.","met / not met",null,"STANDARDS",5.0999999999999996]
[null,null,null,null,"-"]
["RECOMMENDATIONS",null,null,null,"-"]
[1,"Critical care units should nominate a lead for R&D activities who should coordinate activity and ensure it is carried out to UK Policy Framework for Research standards.","met / not met or not applicable ",null,"RECOMMENDATIONS",5.0999999999999996]
[2,"Critical care units should participate in research networks, which are organised at Local Clinical Research Network (LCRN) level through the regional National Institute of Healthcare Research (NIHR) Critical Care research network lead.","met / not met or not applicable ",null,"RECOMMENDATIONS",5.0999999999999996]
[3,"All research studies should be registered on the UK Critical Care Research Portfolio whenever they fulfil eligibility criteria.","met / not met or not applicable ",null,"RECOMMENDATIONS",5.0999999999999996]
{"$rows_left_out":81}
{"sheet":"Emergency Preparedness","index":8,"n_rows":75,"n_cols":7,"rows_kept":75,"cut":false,"hidden":false,"merged":[]}
["Section 6","CRITICAL CARE SERVICES: EMERGENCY PREPAREDNESS","Level description","Level","Hidden","Hidden","Comments"]
[null,null,null,null,"-"]
[6.1,"Fire",null,null,"-"]
[null,null,null,null,"-"]
["STANDARDS",null,null,null,"-"]
[1,"All units must have well marked fire call points, fire extinguishers and oxygen shut-off valves.","Met or unmet",null,"STANDARDS",6.1]
[2,"Each unit must have a specific fire evacuation policy in place, which takes account of: a) the layout of the building, including any need to negotiate stairs during an evacuation, b) the provision of ventilatory support, intravenous therapies and invasive monitoring for patients during such an evacuation, c) the fact that critical care staff may themselves be affected by a fire and therefore be unfit to continue working.  Action cards summarising the evacuation procedure should be displayed within the unit, ideally next to fire call points, so that they can be referred to in an emergency. ","Met or unmet",null,"STANDARDS",6.1]
[3,"Recommendations for the safe use of oxygen cylinders must be adhered to at all times and include: the safe use of oxygen cylinder bed brackets, b) the safe storage of oxygen cylinders and c) following the recommended sequence of events when turning on an oxygen cylinder.","Met / unmet ",null,"STANDARDS",6.1]
[4,"Units must comply with current Department of Health regulations regarding the fire-retardant nature of mattresses, bedding, flooring and curtains.","Met / unmet ",null,"STANDARDS",6.1]
[5,"New units must be designed using Department of Health guidance and in conjunction with the Trust fire safety officer, with consideration given to the provision of: a)multiple exit routes, b) ski pad, ski sheets or other evacuation aids for all bed spaces which are readily available, c) adopting small bays rather than open areas and d) splitting ICU departments into separate clinical and non-clinical areas.","met / not met / not applicable",null,"STANDARDS",6.1]
{"$rows_left_out":66}
{"sheet":"Lookups","index":9,"n_rows":25,"n_cols":6,"rows_kept":25,"cut":false,"hidden":true,"merged":[]}
["0=Not met",null,null,null,null,"Operational Delivery Network (ODN)"]
["1=Partially met",null,null,null,null,"Birmingham, Black Country, Hereford & Worcester Including Central England"]
["2=Fully met",null,null,null,null,"Cheshire & Mersey"]
["3=Not applicable to Unit",null,null,null,null,"East Midlands Formerly Mid Trent"]
[null,null,null,null,null,"East Of England"]
["Please do not delete or alter this sheet.",null,null,null,null,"Greater Manchester"]
[null,null,null,null,null,"Kent, Surrey, Sussex Critical Care Network"]
[null,null,null,null,null,"Lancashire And South Cumbria"]
[null,null,null,null,null,"London - North Central"]
[null,null,null,null,null,"London - North East"]
{"$rows_left_out":15}